{"text_format":"1","workbook":"xlsx","n_sheets":7,"sheets":["Atenção","Conceito","Exemplo","Cadastro de Produtos","Inventário","Estoque","Relatório"],"not_rendered":{"charts":5,"images":11,"macros":1,"external_links":0,"defined_names":9,"comments":1,"pivot_tables":0},"unopened":[],"bounds":{"document_bytes":16777216,"sheet_cells":100000,"rows_first":2000,"rows_last":500,"rows_between":2000,"halvings":0,"cell_chars":16384,"cell_head_chars":4096},"cells_cut":0,"cells_raw":0,"read":"whole","date_system":"1900"}

{"sheet":"Atenção","index":0,"n_rows":21,"n_cols":1,"rows_kept":21,"cut":false,"hidden":false,"merged":[[20,0,21,10]]}
[]
[]
[]
[]
[]
[]
[]
[]
[]
[]
[]
[]
[]
[]
[]
[]
[]
[]
[]
[]
{"$rows_left_out":2}
{"sheet":"Conceito","index":1,"n_rows":0,"n_cols":0,"rows_kept":0,"cut":false,"hidden":false,"merged":[]}

{"sheet":"Exemplo","index":2,"n_rows":0,"n_cols":0,"rows_kept":0,"cut":false,"hidden":false,"merged":[]}

{"sheet":"Cadastro de Produtos","index":3,"n_rows":205,"n_cols":8,"rows_kept":205,"cut":false,"hidden":false,"merged":[[1,1,1,7],[204,1,204,6]]}
[]
[]
[]
[null,"Número do Produto","Nome do Produto","para o procv","Descrição","Unidade de consumo","Estoque Mínimo","Estoque Máximo"]
[null,1,null,{"$f":"B5","v":1}]
[null,2,null,{"$f":"B6","v":2}]
[null,3,null,3]
[null,4,null,4]
[null,5,null,5]
[null,6,null,6]
[null,7,null,7]
[null,8,null,8]
[null,9,null,9]
[null,10,null,10]
[null,11,null,11]
[null,12,null,12]
[null,13,null,13]
[null,14,null,14]
[null,15,null,15]
[null,16,null,16]
{"$rows_left_out":186}
{"sheet":"Inventário","index":4,"n_rows":155,"n_cols":14,"rows_kept":155,"cut":false,"hidden":false,"merged":[[4,6,4,11],[7,2,8,2],[7,3,8,3],[7,1,8,1],[7,4,8,4],[7,12,7,13],[7,10,7,11],[7,8,7,9],[7,6,8,6],[7,7,8,7]]}
[]
[]
[]
[]
[null,null,null,null,null,null,"Pesquisa Rápida"]
[null,null,null,null,null,null,"Produto:",null,"Quantidade:",{"$f":"IF(H6=\"\",\"\",SUMIF(Inventário!E10:E152,$H$6,Inventário!$M$10:$M$150))","v":""},"Valor:",{"$f":"IFERROR(SUMIF($E$10:$E$150,$H$6,$N$10:$N$150),\"✖\")","v":0}]
[]
[null,"Data","mês","ano","Produto",null,"Valor unitário","Validade","Entradas",null,"Saídas",null,"Saldo Diário"]
[null,null,null,null,null,"PROCV",null,null,"Quantidade","Valor total","Quantidade","Valor Total","Quantidade","Valor Total"]
[null,null,{"$f":"IF(B10=\"\",\"\",(MONTH(B10)))","v":""},{"$f":"IF(C10=\"\",\"\",IF(C10=1,\"JAN\",IF(C10=2,\"FEV\",IF(C10=3,\"MAR\",IF(C10=4,\"ABR\",IF(C10=5,\"MAI\",IF(C10=6,\"JUN\",IF(C10=7,\"JUL\",IF(C10=8,\"AGO\",IF(C10=9,\"SET\",IF(C10=10,\"OUT\",IF(C10=11,\"NOV\",IF(C10=12,\"DEZ\",\"ERRO\")))))))))))))","v":""},null,{"$f":"IF(E10=\"\",\"\",VLOOKUP(E10,'Cadastro de Produtos'!$C$5:$E$204,2,0))","v":""},null,null,null,{"$f":"IF(I10=\"\",\"\",G10*I10)","v":""},null,{"$f":"IF(K10=\"\",\"\",K10*G10)","v":""},{"$f":"IF(I10-K10=0,\"\",I10-K10)","v":""},{"$f":"IF(M10=\"\",\"\",M10*G10)","v":""}]
[null,null,"","",null,{"$f":"IF(E11=\"\",\"\",VLOOKUP(E11,'Cadastro de Produtos'!$C$5:$E$204,2,0))","v":""},null,null,null,"",null,"",{"$f":"IF(I11-K11=0,\"\",I11-K11)","v":""},""]
[null,null,"","",null,{"$f":"IF(E12=\"\",\"\",VLOOKUP(E12,'Cadastro de Produtos'!$C$5:$E$204,2,0))","v":""},null,null,null,"",null,"","",""]
[null,null,"","",null,{"$f":"IF(E13=\"\",\"\",VLOOKUP(E13,'Cadastro de Produtos'!$C$5:$E$204,2,0))","v":""},null,null,null,"",null,"","",""]
[null,null,"","",null,{"$f":"IF(E14=\"\",\"\",VLOOKUP(E14,'Cadastro de Produtos'!$C$5:$E$204,2,0))","v":""},null,null,null,"",null,"",{"$f":"IF(I14-K14=0,\"\",I14-K14)","v":""},""]
[null,null,"","",null,{"$f":"IF(E15=\"\",\"\",VLOOKUP(E15,'Cadastro de Produtos'!$C$5:$E$204,2,0))","v":""},null,null,null,"",null,"","",""]
[null,null,"","",null,{"$f":"IF(E16=\"\",\"\",VLOOKUP(E16,'Cadastro de Produtos'!$C$5:$E$204,2,0))","v":""},null,null,null,"",null,"","",""]
[null,null,"","",null,{"$f":"IF(E17=\"\",\"\",VLOOKUP(E17,'Cadastro de Produtos'!$C$5:$E$204,2,0))","v":""},null,null,null,"",null,"","",""]
[null,null,"","",null,{"$f":"IF(E18=\"\",\"\",VLOOKUP(E18,'Cadastro de Produtos'!$C$5:$E$204,2,0))","v":""},null,null,null,"",null,"","",""]
[null,null,"","",null,{"$f":"IF(E19=\"\",\"\",VLOOKUP(E19,'Cadastro de Produtos'!$C$5:$E$204,2,0))","v":""},null,null,null,"",null,"","",""]
[null,null,{"$f":"IF(B20=\"\",\"\",(MONTH(B20)))","v":""},{"$f":"IF(C20=\"\",\"\",IF(C20=1,\"JAN\",IF(C20=2,\"FEV\",IF(C20=3,\"MAR\",IF(C20=4,\"ABR\",IF(C20=5,\"MAI\",IF(C20=6,\"JUN\",IF(C20=7,\"JUL\",IF(C20=8,\"AGO\",IF(C20=9,\"SET\",IF(C20=10,\"OUT\",IF(C20=11,\"NOV\",IF(C20=12,\"DEZ\",\"ERRO\")))))))))))))","v":""},null,{"$f":"IF(E20=\"\",\"\",VLOOKUP(E20,'Cadastro de Produtos'!$C$5:$E$204,2,0))","v":""},null,null,null,"",null,"","",""]
{"$rows_left_out":136}
{"sheet":"Estoque","index":5,"n_rows":237,"n_cols":19,"rows_kept":237,"cut":false,"hidden":false,"merged":[[7,3,7,14],[2,3,3,11],[7,19,7,30],[2,18,3,30],[4,4,4,9]]}
[]
[]
[]
[]
[null,null,null,null,"Pesquisa Rápida"]
[null,null,null,null,"Produto:",null,"Quantidade:",{"$f":"IF(F6=\"\",\"\",SUMIF(Inventário!$E$10:$E$150,Estoque!$F$6,Inventário!$M$10:$M$150))","v":""},"Valor:",{"$f":"IFERROR(SUMIF(Inventário!$E$10:$E$150,Estoque!$F$6,Inventário!$N$10:$N$150),\"✖\")","v":0}]
[]
[null,null,null,"Valor dos Estoques"]
[]
[null,null,"Produtos e matérias-prima em estoque","Jan","Fev","Mar","Abr","Mai","Jun","Jul","Ago","Set","Out","Nov","Dez","Consolidado"]
[null,null,null,1,2,3,4,5,6,7,8,9,10,11,12]
[null,null,"Valor de estoque consolidado",{"$f":"D13","v":0},{"$f":"E13+D12","v":0},{"$f":"F13+E12","v":0},0,0,0,0,0,0,0,0,0]
[null,null,"Movimentação de Estoque no mês (Entradas - Saídas)",{"$f":"SUM(D14:D237)","v":0},0,0,0,0,0,0,0,0,0,0,0]
[null,1,{"$f":"IF('Cadastro de Produtos'!C5=\"\",\"\",VLOOKUP(B14,'Cadastro de Produtos'!$B$5:$C$204,2,0))","v":""},{"$f":"IFERROR(IF(C14=\"\",\"\",SUMIFS(Inventário!$N$10:$N$150,Inventário!$D$10:$D$150,Estoque!D$10,Inventário!$E$10:$E$150,Estoque!$C14)),\"ERRO\")","v":""},{"$f":"IFERROR(IF(D14=\"\",\"\",SUMIFS(Inventário!$N$10:$N$150,Inventário!$D$10:$D$150,Estoque!E$10,Inventário!$E$10:$E$150,Estoque!$C14)),\"ERRO\")","v":""},{"$f":"IFERROR(IF(E14=\"\",\"\",SUMIFS(Inventário!$N$10:$N$150,Inventário!$D$10:$D$150,Estoque!F$10,Inventário!$E$10:$E$150,Estoque!$C14)),\"ERRO\")","v":""},{"$f":"IFERROR(IF(F14=\"\",\"\",SUMIFS(Inventário!$N$10:$N$150,Inventário!$D$10:$D$150,Estoque!G$10,Inventário!$E$10:$E$150,Estoque!$C14)),\"ERRO\")","v":""},{"$f":"IFERROR(IF(G14=\"\",\"\",SUMIFS(Inventário!$N$10:$N$150,Inventário!$D$10:$D$150,Estoque!H$10,Inventário!$E$10:$E$150,Estoque!$C14)),\"ERRO\")","v":""},{"$f":"IFERROR(IF(H14=\"\",\"\",SUMIFS(Inventário!$N$10:$N$150,Inventário!$D$10:$D$150,Estoque!I$10,Inventário!$E$10:$E$150,Estoque!$C14)),\"ERRO\")","v":""},{"$f":"IFERROR(IF(I14=\"\",\"\",SUMIFS(Inventário!$N$10:$N$150,Inventário!$D$10:$D$150,Estoque!J$10,Inventário!$E$10:$E$150,Estoque!$C14)),\"ERRO\")","v":""},{"$f":"IFERROR(IF(C14=\"\",\"\",SUMIFS(Inventário!$N$10:$N$150,Inventário!$D$10:$D$150,Estoque!K$10,Inventário!$E$10:$E$150,Estoque!$C14)),\"ERRO\")","v":""},{"$f":"IFERROR(IF(K14=\"\",\"\",SUMIFS(Inventário!$N$10:$N$150,Inventário!$D$10:$D$150,Estoque!L$10,Inventário!$E$10:$E$150,Estoque!$C14)),\"ERRO\")","v":""},{"$f":"IFERROR(IF(L14=\"\",\"\",SUMIFS(Inventário!$N$10:$N$150,Inventário!$D$10:$D$150,Estoque!M$10,Inventário!$E$10:$E$150,Estoque!$C14)),\"ERRO\")","v":""},{"$f":"IFERROR(IF(M14=\"\",\"\",SUMIFS(Inventário!$N$10:$N$150,Inventário!$D$10:$D$150,Estoque!N$10,Inventário!$E$10:$E$150,Estoque!$C14)),\"ERRO\")","v":""},{"$f":"IFERROR(IF(N14=\"\",\"\",SUMIFS(Inventário!$N$10:$N$150,Inventário!$D$10:$D$150,Estoque!O$10,Inventário!$E$10:$E$150,Estoque!$C14)),\"ERRO\")","v":""},null,null,null,{"$f":"Inventário!$E10","v":0}]
[null,2,{"$f":"IF('Cadastro de Produtos'!C6=\"\",\"\",VLOOKUP(B15,'Cadastro de Produtos'!$B$5:$C$204,2,0))","v":""},{"$f":"IFERROR(IF(C15=\"\",\"\",SUMIFS(Inventário!$N$10:$N$150,Inventário!$D$10:$D$150,Estoque!D$10,Inventário!$E$10:$E$150,Estoque!$C15)),\"ERRO\")","v":""},{"$f":"IFERROR(IF(D15=\"\",\"\",SUMIFS(Inventário!$N$10:$N$150,Inventário!$D$10:$D$150,Estoque!E$10,Inventário!$E$10:$E$150,Estoque!$C15)),\"ERRO\")","v":""},{"$f":"IFERROR(IF(E15=\"\",\"\",SUMIFS(Inventário!$N$10:$N$150,Inventário!$D$10:$D$150,Estoque!F$10,Inventário!$E$10:$E$150,Estoque!$C15)),\"ERRO\")","v":""},{"$f":"IFERROR(IF(F15=\"\",\"\",SUMIFS(Inventário!$N$10:$N$150,Inventário!$D$10:$D$150,Estoque!G$10,Inventário!$E$10:$E$150,Estoque!$C15)),\"ERRO\")","v":""},{"$f":"IFERROR(IF(G15=\"\",\"\",SUMIFS(Inventário!$N$10:$N$150,Inventário!$D$10:$D$150,Estoque!H$10,Inventário!$E$10:$E$150,Estoque!$C15)),\"ERRO\")","v":""},{"$f":"IFERROR(IF(H15=\"\",\"\",SUMIFS(Inventário!$N$10:$N$150,Inventário!$D$10:$D$150,Estoque!I$10,Inventário!$E$10:$E$150,Estoque!$C15)),\"ERRO\")","v":""},{"$f":"IFERROR(IF(I15=\"\",\"\",SUMIFS(Inventário!$N$10:$N$150,Inventário!$D$10:$D$150,Estoque!J$10,Inventário!$E$10:$E$150,Estoque!$C15)),\"ERRO\")","v":""},{"$f":"IFERROR(IF(J15=\"\",\"\",SUMIFS(Inventário!$N$10:$N$150,Inventário!$D$10:$D$150,Estoque!K$10,Inventário!$E$10:$E$150,Estoque!$C15)),\"ERRO\")","v":""},{"$f":"IFERROR(IF(K15=\"\",\"\",SUMIFS(Inventário!$N$10:$N$150,Inventário!$D$10:$D$150,Estoque!L$10,Inventário!$E$10:$E$150,Estoque!$C15)),\"ERRO\")","v":""},{"$f":"IFERROR(IF(L15=\"\",\"\",SUMIFS(Inventário!$N$10:$N$150,Inventário!$D$10:$D$150,Estoque!M$10,Inventário!$E$10:$E$150,Estoque!$C15)),\"ERRO\")","v":""},{"$f":"IFERROR(IF(M15=\"\",\"\",SUMIFS(Inventário!$N$10:$N$150,Inventário!$D$10:$D$150,Estoque!N$10,Inventário!$E$10:$E$150,Estoque!$C15)),\"ERRO\")","v":""},{"$f":"IFERROR(IF(N15=\"\",\"\",SUMIFS(Inventário!$N$10:$N$150,Inventário!$D$10:$D$150,Estoque!O$10,Inventário!$E$10:$E$150,Estoque!$C15)),\"ERRO\")","v":""},null,null,null,{"$f":"Inventário!$E11","v":0}]
[null,3,{"$f":"IF('Cadastro de Produtos'!C7=\"\",\"\",VLOOKUP(B16,'Cadastro de Produtos'!$B$5:$C$204,2,0))","v":""},{"$f":"IFERROR(IF(C16=\"\",\"\",SUMIFS(Inventário!$N$10:$N$150,Inventário!$D$10:$D$150,Estoque!D$10,Inventário!$E$10:$E$150,Estoque!$C16)),\"ERRO\")","v":""},{"$f":"IFERROR(IF(D16=\"\",\"\",SUMIFS(Inventário!$N$10:$N$150,Inventário!$D$10:$D$150,Estoque!E$10,Inventário!$E$10:$E$150,Estoque!$C16)),\"ERRO\")","v":""},{"$f":"IFERROR(IF(E16=\"\",\"\",SUMIFS(Inventário!$N$10:$N$150,Inventário!$D$10:$D$150,Estoque!F$10,Inventário!$E$10:$E$150,Estoque!$C16)),\"ERRO\")","v":""},{"$f":"IFERROR(IF(F16=\"\",\"\",SUMIFS(Inventário!$N$10:$N$150,Inventário!$D$10:$D$150,Estoque!G$10,Inventário!$E$10:$E$150,Estoque!$C16)),\"ERRO\")","v":""},{"$f":"IFERROR(IF(G16=\"\",\"\",SUMIFS(Inventário!$N$10:$N$150,Inventário!$D$10:$D$150,Estoque!H$10,Inventário!$E$10:$E$150,Estoque!$C16)),\"ERRO\")","v":""},{"$f":"IFERROR(IF(H16=\"\",\"\",SUMIFS(Inventário!$N$10:$N$150,Inventário!$D$10:$D$150,Estoque!I$10,Inventário!$E$10:$E$150,Estoque!$C16)),\"ERRO\")","v":""},{"$f":"IFERROR(IF(I16=\"\",\"\",SUMIFS(Inventário!$N$10:$N$150,Inventário!$D$10:$D$150,Estoque!J$10,Inventário!$E$10:$E$150,Estoque!$C16)),\"ERRO\")","v":""},{"$f":"IFERROR(IF(J16=\"\",\"\",SUMIFS(Inventário!$N$10:$N$150,Inventário!$D$10:$D$150,Estoque!K$10,Inventário!$E$10:$E$150,Estoque!$C16)),\"ERRO\")","v":""},{"$f":"IFERROR(IF(K16=\"\",\"\",SUMIFS(Inventário!$N$10:$N$150,Inventário!$D$10:$D$150,Estoque!L$10,Inventário!$E$10:$E$150,Estoque!$C16)),\"ERRO\")","v":""},{"$f":"IFERROR(IF(L16=\"\",\"\",SUMIFS(Inventário!$N$10:$N$150,Inventário!$D$10:$D$150,Estoque!M$10,Inventário!$E$10:$E$150,Estoque!$C16)),\"ERRO\")","v":""},{"$f":"IFERROR(IF(M16=\"\",\"\",SUMIFS(Inventário!$N$10:$N$150,Inventário!$D$10:$D$150,Estoque!N$10,Inventário!$E$10:$E$150,Estoque!$C16)),\"ERRO\")","v":""},{"$f":"IFERROR(IF(N16=\"\",\"\",SUMIFS(Inventário!$N$10:$N$150,Inventário!$D$10:$D$150,Estoque!O$10,Inventário!$E$10:$E$150,Estoque!$C16)),\"ERRO\")","v":""},null,null,null,{"$f":"Inventário!$E12","v":0}]
[null,4,{"$f":"IF('Cadastro de Produtos'!C8=\"\",\"\",VLOOKUP(B17,'Cadastro de Produtos'!$B$5:$C$204,2,0))","v":""},{"$f":"IFERROR(IF(C17=\"\",\"\",SUMIFS(Inventário!$N$10:$N$150,Inventário!$D$10:$D$150,Estoque!D$10,Inventário!$E$10:$E$150,Estoque!$C17)),\"ERRO\")","v":""},{"$f":"IFERROR(IF(D17=\"\",\"\",SUMIFS(Inventário!$N$10:$N$150,Inventário!$D$10:$D$150,Estoque!E$10,Inventário!$E$10:$E$150,Estoque!$C17)),\"ERRO\")","v":""},{"$f":"IFERROR(IF(E17=\"\",\"\",SUMIFS(Inventário!$N$10:$N$150,Inventário!$D$10:$D$150,Estoque!F$10,Inventário!$E$10:$E$150,Estoque!$C17)),\"ERRO\")","v":""},{"$f":"IFERROR(IF(F17=\"\",\"\",SUMIFS(Inventário!$N$10:$N$150,Inventário!$D$10:$D$150,Estoque!G$10,Inventário!$E$10:$E$150,Estoque!$C17)),\"ERRO\")","v":""},{"$f":"IFERROR(IF(G17=\"\",\"\",SUMIFS(Inventário!$N$10:$N$150,Inventário!$D$10:$D$150,Estoque!H$10,Inventário!$E$10:$E$150,Estoque!$C17)),\"ERRO\")","v":""},{"$f":"IFERROR(IF(H17=\"\",\"\",SUMIFS(Inventário!$N$10:$N$150,Inventário!$D$10:$D$150,Estoque!I$10,Inventário!$E$10:$E$150,Estoque!$C17)),\"ERRO\")","v":""},{"$f":"IFERROR(IF(I17=\"\",\"\",SUMIFS(Inventário!$N$10:$N$150,Inventário!$D$10:$D$150,Estoque!J$10,Inventário!$E$10:$E$150,Estoque!$C17)),\"ERRO\")","v":""},{"$f":"IFERROR(IF(J17=\"\",\"\",SUMIFS(Inventário!$N$10:$N$150,Inventário!$D$10:$D$150,Estoque!K$10,Inventário!$E$10:$E$150,Estoque!$C17)),\"ERRO\")","v":""},{"$f":"IFERROR(IF(K17=\"\",\"\",SUMIFS(Inventário!$N$10:$N$150,Inventário!$D$10:$D$150,Estoque!L$10,Inventário!$E$10:$E$150,Estoque!$C17)),\"ERRO\")","v":""},{"$f":"IFERROR(IF(L17=\"\",\"\",SUMIFS(Inventário!$N$10:$N$150,Inventário!$D$10:$D$150,Estoque!M$10,Inventário!$E$10:$E$150,Estoque!$C17)),\"ERRO\")","v":""},{"$f":"IFERROR(IF(M17=\"\",\"\",SUMIFS(Inventário!$N$10:$N$150,Inventário!$D$10:$D$150,Estoque!N$10,Inventário!$E$10:$E$150,Estoque!$C17)),\"ERRO\")","v":""},{"$f":"IFERROR(IF(N17=\"\",\"\",SUMIFS(Inventário!$N$10:$N$150,Inventário!$D$10:$D$150,Estoque!O$10,Inventário!$E$10:$E$150,Estoque!$C17)),\"ERRO\")","v":""},null,null,null,{"$f":"Inventário!$E13","v":0}]
[null,5,{"$f":"IF('Cadastro de Produtos'!C9=\"\",\"\",VLOOKUP(B18,'Cadastro de Produtos'!$B$5:$C$204,2,0))","v":""},{"$f":"IFERROR(IF(C18=\"\",\"\",SUMIFS(Inventário!$N$10:$N$150,Inventário!$D$10:$D$150,Estoque!D$10,Inventário!$E$10:$E$150,Estoque!$C18)),\"ERRO\")","v":""},{"$f":"IFERROR(IF(D18=\"\",\"\",SUMIFS(Inventário!$N$10:$N$150,Inventário!$D$10:$D$150,Estoque!E$10,Inventário!$E$10:$E$150,Estoque!$C18)),\"ERRO\")","v":""},{"$f":"IFERROR(IF(E18=\"\",\"\",SUMIFS(Inventário!$N$10:$N$150,Inventário!$D$10:$D$150,Estoque!F$10,Inventário!$E$10:$E$150,Estoque!$C18)),\"ERRO\")","v":""},{"$f":"IFERROR(IF(F18=\"\",\"\",SUMIFS(Inventário!$N$10:$N$150,Inventário!$D$10:$D$150,Estoque!G$10,Inventário!$E$10:$E$150,Estoque!$C18)),\"ERRO\")","v":""},{"$f":"IFERROR(IF(G18=\"\",\"\",SUMIFS(Inventário!$N$10:$N$150,Inventário!$D$10:$D$150,Estoque!H$10,Inventário!$E$10:$E$150,Estoque!$C18)),\"ERRO\")","v":""},{"$f":"IFERROR(IF(H18=\"\",\"\",SUMIFS(Inventário!$N$10:$N$150,Inventário!$D$10:$D$150,Estoque!I$10,Inventário!$E$10:$E$150,Estoque!$C18)),\"ERRO\")","v":""},{"$f":"IFERROR(IF(I18=\"\",\"\",SUMIFS(Inventário!$N$10:$N$150,Inventário!$D$10:$D$150,Estoque!J$10,Inventário!$E$10:$E$150,Estoque!$C18)),\"ERRO\")","v":""},{"$f":"IFERROR(IF(J18=\"\",\"\",SUMIFS(Inventário!$N$10:$N$150,Inventário!$D$10:$D$150,Estoque!K$10,Inventário!$E$10:$E$150,Estoque!$C18)),\"ERRO\")","v":""},{"$f":"IFERROR(IF(K18=\"\",\"\",SUMIFS(Inventário!$N$10:$N$150,Inventário!$D$10:$D$150,Estoque!L$10,Inventário!$E$10:$E$150,Estoque!$C18)),\"ERRO\")","v":""},{"$f":"IFERROR(IF(L18=\"\",\"\",SUMIFS(Inventário!$N$10:$N$150,Inventário!$D$10:$D$150,Estoque!M$10,Inventário!$E$10:$E$150,Estoque!$C18)),\"ERRO\")","v":""},{"$f":"IFERROR(IF(M18=\"\",\"\",SUMIFS(Inventário!$N$10:$N$150,Inventário!$D$10:$D$150,Estoque!N$10,Inventário!$E$10:$E$150,Estoque!$C18)),\"ERRO\")","v":""},{"$f":"IFERROR(IF(N18=\"\",\"\",SUMIFS(Inventário!$N$10:$N$150,Inventário!$D$10:$D$150,Estoque!O$10,Inventário!$E$10:$E$150,Estoque!$C18)),\"ERRO\")","v":""},null,null,null,{"$f":"Inventário!$E14","v":0}]
[null,6,{"$f":"IF('Cadastro de Produtos'!C10=\"\",\"\",VLOOKUP(B19,'Cadastro de Produtos'!$B$5:$C$204,2,0))","v":""},{"$f":"IFERROR(IF(C19=\"\",\"\",SUMIFS(Inventário!$N$10:$N$150,Inventário!$D$10:$D$150,Estoque!D$10,Inventário!$E$10:$E$150,Estoque!$C19)),\"ERRO\")","v":""},{"$f":"IFERROR(IF(D19=\"\",\"\",SUMIFS(Inventário!$N$10:$N$150,Inventário!$D$10:$D$150,Estoque!E$10,Inventário!$E$10:$E$150,Estoque!$C19)),\"ERRO\")","v":""},{"$f":"IFERROR(IF(E19=\"\",\"\",SUMIFS(Inventário!$N$10:$N$150,Inventário!$D$10:$D$150,Estoque!F$10,Inventário!$E$10:$E$150,Estoque!$C19)),\"ERRO\")","v":""},{"$f":"IFERROR(IF(F19=\"\",\"\",SUMIFS(Inventário!$N$10:$N$150,Inventário!$D$10:$D$150,Estoque!G$10,Inventário!$E$10:$E$150,Estoque!$C19)),\"ERRO\")","v":""},{"$f":"IFERROR(IF(G19=\"\",\"\",SUMIFS(Inventário!$N$10:$N$150,Inventário!$D$10:$D$150,Estoque!H$10,Inventário!$E$10:$E$150,Estoque!$C19)),\"ERRO\")","v":""},{"$f":"IFERROR(IF(H19=\"\",\"\",SUMIFS(Inventário!$N$10:$N$150,Inventário!$D$10:$D$150,Estoque!I$10,Inventário!$E$10:$E$150,Estoque!$C19)),\"ERRO\")","v":""},{"$f":"IFERROR(IF(I19=\"\",\"\",SUMIFS(Inventário!$N$10:$N$150,Inventário!$D$10:$D$150,Estoque!J$10,Inventário!$E$10:$E$150,Estoque!$C19)),\"ERRO\")","v":""},{"$f":"IFERROR(IF(J19=\"\",\"\",SUMIFS(Inventário!$N$10:$N$150,Inventário!$D$10:$D$150,Estoque!K$10,Inventário!$E$10:$E$150,Estoque!$C19)),\"ERRO\")","v":""},{"$f":"IFERROR(IF(K19=\"\",\"\",SUMIFS(Inventário!$N$10:$N$150,Inventário!$D$10:$D$150,Estoque!L$10,Inventário!$E$10:$E$150,Estoque!$C19)),\"ERRO\")","v":""},{"$f":"IFERROR(IF(L19=\"\",\"\",SUMIFS(Inventário!$N$10:$N$150,Inventário!$D$10:$D$150,Estoque!M$10,Inventário!$E$10:$E$150,Estoque!$C19)),\"ERRO\")","v":""},{"$f":"IFERROR(IF(M19=\"\",\"\",SUMIFS(Inventário!$N$10:$N$150,Inventário!$D$10:$D$150,Estoque!N$10,Inventário!$E$10:$E$150,Estoque!$C19)),\"ERRO\")","v":""},{"$f":"IFERROR(IF(N19=\"\",\"\",SUMIFS(Inventário!$N$10:$N$150,Inventário!$D$10:$D$150,Estoque!O$10,Inventário!$E$10:$E$150,Estoque!$C19)),\"ERRO\")","v":""},null,null,null,{"$f":"Inventário!$E15","v":0}]
[null,7,{"$f":"IF('Cadastro de Produtos'!C11=\"\",\"\",VLOOKUP(B20,'Cadastro de Produtos'!$B$5:$C$204,2,0))","v":""},{"$f":"IFERROR(IF(C20=\"\",\"\",SUMIFS(Inventário!$N$10:$N$150,Inventário!$D$10:$D$150,Estoque!D$10,Inventário!$E$10:$E$150,Estoque!$C20)),\"ERRO\")","v":""},{"$f":"IFERROR(IF(D20=\"\",\"\",SUMIFS(Inventário!$N$10:$N$150,Inventário!$D$10:$D$150,Estoque!E$10,Inventário!$E$10:$E$150,Estoque!$C20)),\"ERRO\")","v":""},{"$f":"IFERROR(IF(E20=\"\",\"\",SUMIFS(Inventário!$N$10:$N$150,Inventário!$D$10:$D$150,Estoque!F$10,Inventário!$E$10:$E$150,Estoque!$C20)),\"ERRO\")","v":""},{"$f":"IFERROR(IF(F20=\"\",\"\",SUMIFS(Inventário!$N$10:$N$150,Inventário!$D$10:$D$150,Estoque!G$10,Inventário!$E$10:$E$150,Estoque!$C20)),\"ERRO\")","v":""},{"$f":"IFERROR(IF(G20=\"\",\"\",SUMIFS(Inventário!$N$10:$N$150,Inventário!$D$10:$D$150,Estoque!H$10,Inventário!$E$10:$E$150,Estoque!$C20)),\"ERRO\")","v":""},{"$f":"IFERROR(IF(H20=\"\",\"\",SUMIFS(Inventário!$N$10:$N$150,Inventário!$D$10:$D$150,Estoque!I$10,Inventário!$E$10:$E$150,Estoque!$C20)),\"ERRO\")","v":""},{"$f":"IFERROR(IF(I20=\"\",\"\",SUMIFS(Inventário!$N$10:$N$150,Inventário!$D$10:$D$150,Estoque!J$10,Inventário!$E$10:$E$150,Estoque!$C20)),\"ERRO\")","v":""},{"$f":"IFERROR(IF(J20=\"\",\"\",SUMIFS(Inventário!$N$10:$N$150,Inventário!$D$10:$D$150,Estoque!K$10,Inventário!$E$10:$E$150,Estoque!$C20)),\"ERRO\")","v":""},{"$f":"IFERROR(IF(K20=\"\",\"\",SUMIFS(Inventário!$N$10:$N$150,Inventário!$D$10:$D$150,Estoque!L$10,Inventário!$E$10:$E$150,Estoque!$C20)),\"ERRO\")","v":""},{"$f":"IFERROR(IF(L20=\"\",\"\",SUMIFS(Inventário!$N$10:$N$150,Inventário!$D$10:$D$150,Estoque!M$10,Inventário!$E$10:$E$150,Estoque!$C20)),\"ERRO\")","v":""},{"$f":"IFERROR(IF(M20=\"\",\"\",SUMIFS(Inventário!$N$10:$N$150,Inventário!$D$10:$D$150,Estoque!N$10,Inventário!$E$10:$E$150,Estoque!$C20)),\"ERRO\")","v":""},{"$f":"IFERROR(IF(N20=\"\",\"\",SUMIFS(Inventário!$N$10:$N$150,Inventário!$D$10:$D$150,Estoque!O$10,Inventário!$E$10:$E$150,Estoque!$C20)),\"ERRO\")","v":""},null,null,null,{"$f":"Inventário!$E16","v":0}]
{"$rows_left_out":218}
{"sheet":"Relatório","index":6,"n_rows":110,"n_cols":14,"rows_kept":110,"cut":false,"hidden":false,"merged":[[48,0,48,18],[109,0,109,19],[1,1,1,8],[72,2,72,7],[73,2,75,2],[73,5,75,5],[75,3,75,4],[75,6,75,7],[4,0,4,18],[27,0,27,19],[79,0,79,19]]}
[]
[]
[]
[]
["Valor do estoque consolidado no período\n"]
[]
[]
[]
[]
[]
[]
[]
[]
[]
[]
[]
[]
[]
[]
[]
{"$rows_left_out":90}